{"text_format":"1","workbook":"xlsx","n_sheets":20,"sheets":["Petunjuk","List","I","II","III","IV.1","IV.2.1","IV.2.2","IV.3","IV.4","IV.5","IV.6","V.Penerimaan","VI.Pengeluaran","Lampiran1-Penjualan-Pelepasan","Lampiran2-Fasilitas","Lampiran3-SKM","Lampiran4-SKB","Lembar Penyerahan","DATA"],"not_rendered":{"charts":0,"images":2,"macros":1,"external_links":0,"defined_names":33,"comments":0,"pivot_tables":0},"unopened":[],"bounds":{"document_bytes":16777216,"sheet_cells":100000,"rows_first":2000,"rows_last":500,"rows_between":2000,"halvings":0,"cell_chars":16384,"cell_head_chars":4096},"cells_cut":0,"cells_raw":0,"read":"whole","date_system":"1900"}

{"sheet":"Petunjuk","index":0,"n_rows":29,"n_cols":5,"rows_kept":29,"cut":false,"hidden":false,"merged":[[24,2,24,12],[5,2,5,12],[28,2,28,12],[21,3,21,12],[22,3,22,12],[23,3,23,12],[18,2,18,12],[19,2,19,12],[20,2,20,12],[9,2,9,12],[10,2,10,12],[17,2,17,12],[7,2,7,12],[8,2,8,12]]}
[]
[]
[]
[]
[]
[null,null,"TATA CARA MELAPORKAN LHKPN DENGAN FORMULIR FORMAT EXCEL"]
{"$rows_left_out":24}
{"sheet":"List","index":1,"n_rows":6,"n_cols":3,"rows_kept":6,"cut":false,"hidden":true,"merged":[]}
[]
[null,"NIK",":"]
[null,"Nama",":"]
[null,"Instansi",":"]
[null,"Email",":"]
[null,"HP",":"]
{"$rows_left_out":1}
{"sheet":"I","index":2,"n_rows":53,"n_cols":63,"rows_kept":53,"cut":false,"hidden":false,"merged":[[36,20,36,29],[38,20,38,29],[1,1,2,59],[3,8,3,11],[3,14,3,17],[3,20,3,26],[18,17,18,57],[7,28,7,35],[16,17,16,36],[16,38,16,57],[8,53,8,54],[8,26,8,34],[41,3,41,57],[12,47,12,57],[28,48,28,56],[30,48,30,56],[32,48,32,56],[34,48,34,56],[20,2,20,57],[22,48,22,56],[24,48,24,56],[26,48,26,56],[14,17,14,36],[14,38,14,57],[12,22,12,45],[12,17,12,20],[36,48,36,56],[38,48,38,56],[51,56,51,58],[47,47,47,56],[50,3,50,57],[42,4,42,57],[43,4,43,57],[45,46,45,57],[44,52,44,56],[44,46,44,50],[48,47,48,56]]}
[]
[null,"LAPORAN HARTA KEKAYAAN PENYELENGGARA NEGARA"]
[]
[null,null,null,null,null,null,null,null," ",null,null,null,null,null," "]
[null,null,null,"JENIS LAPORAN",null,null,null,null,null,null,null,null,null,null,null,null,":",null,"Laporan Khusus",null,null,null,null,null,null,null,null,null,null,null,null,null,null,null,null,null,null,null,null,null,null,null,null,null,null,null,"Laporan Periodik"]
[]
{"$rows_left_out":48}
{"sheet":"II","index":3,"n_rows":35,"n_cols":47,"rows_kept":35,"cut":false,"hidden":false,"merged":[[33,39,33,43],[26,17,26,43],[1,2,1,43],[3,2,3,43],[24,17,24,43],[12,17,12,33],[18,17,18,43],[23,3,23,11],[23,27,23,32],[6,17,6,33],[8,17,8,33],[16,17,16,33],[4,24,4,33],[28,17,28,43],[14,17,14,20],[22,17,22,43],[14,22,14,33],[4,17,4,22],[4,35,4,43],[18,3,18,15],[6,35,14,43],[10,19,10,20],[10,22,10,23]]}
[]
[null,null,"II.  DATA PRIBADI"]
[]
[]
[null,null,"1.","Gelar/ Nama/ Gelar",null,null,null,null,null,null,null,null,null,null,null,null,":",{"$f":"IF(I!R13=\"\",\"\",I!R13)","v":""},null,null,null,null,null,"/",{"$f":"IF(I!W13=\"\",\"\",I!W13)","v":""},null,null,null,null,null,null,null,null,null,"/",{"$f":"IF(I!AV13=\"\",\"\",I!AV13)","v":""}]
[]
{"$rows_left_out":30}
{"sheet":"III","index":4,"n_rows":35,"n_cols":65,"rows_kept":35,"cut":false,"hidden":false,"merged":[[17,47,22,55],[21,4,21,12],[23,47,28,55],[27,4,27,12],[17,27,22,38],[23,27,28,38],[17,4,19,6],[17,7,19,12],[23,4,25,6],[23,7,25,12],[5,47,10,55],[11,47,16,55],[15,4,15,12],[5,27,10,38],[11,27,16,38],[5,7,7,12],[5,4,7,6],[5,14,6,16],[5,17,6,25],[11,4,13,6],[11,7,13,12],[4,4,4,12],[4,13,4,26],[4,27,4,38],[4,39,4,46],[4,47,4,55],[1,1,1,56],[3,4,3,12],[3,13,3,26],[3,27,3,38],[3,39,3,46],[3,47,3,55],[5,3,10,3],[11,3,16,3],[17,3,22,3],[23,3,28,3],[5,39,10,46],[11,39,16,46],[17,39,22,46],[23,39,28,46],[9,4,9,12],[11,14,12,16],[11,17,12,25],[17,14,18,16],[17,17,18,25],[23,14,24,16],[23,17,24,25]]}
[]
[null,"III. DATA KELUARGA"]
[]
[null,null,null,"No.","NAMA/HUBUNGAN",null,null,null,null,null,null,null,null,"TEMPAT DAN TANGGAL LAHIR/\nJENIS KELAMIN",null,null,null,null,null,null,null,null,null,null,null,null,null,"PEKERJAAN",null,null,null,null,null,null,null,null,null,null,null,"NO TELEPON/ HANDPHONE",null,null,null,null,null,null,null,"ALAMAT RUMAH"]
[null,null,null,"(1)","(2)",null,null,null,null,null,null,null,null,"(3)",null,null,null,null,null,null,null,null,null,null,null,null,null,"(4)",null,null,null,null,null,null,null,null,null,null,null,"(5)",null,null,null,null,null,null,null,"(6)"]
[null,null,null,null,"Nama :",null,null,null,null,null,null,null,null,null,"Tempat Lahir:",null,null,null,null,null,null,null,null,null,null,null,null,null,null,null,null,null,null,null,null,null,null,null,null,null,null,null,null,null,null,null,null,null,null,null,null,null,null,null,null,null,null,null,null,"Tanggal Lahir 1"]
{"$rows_left_out":30}
{"sheet":"IV.1","index":5,"n_rows":70,"n_cols":57,"rows_kept":70,"cut":false,"hidden":false,"merged":[[43,41,43,45],[28,40,28,45],[7,2,21,2],[23,2,37,2],[39,2,52,2],[18,8,18,19],[26,8,26,19],[28,8,28,19],[31,8,31,19],[44,8,44,19],[47,8,47,19],[10,8,10,19],[12,8,12,19],[15,8,15,19],[20,8,20,19],[26,49,26,53],[12,40,12,45],[12,48,12,53],[31,48,31,53],[26,22,26,24],[26,32,26,37],[1,2,1,54],[5,47,5,54],[5,39,5,46],[3,27,4,38],[3,21,4,26],[3,39,4,46],[3,2,4,2],[3,47,4,54],[5,21,5,26],[5,27,5,38],[3,3,4,20],[5,3,5,20],[53,49,54,53],[51,8,51,19],[42,32,42,37],[54,2,54,45],[34,8,34,19],[42,8,42,19],[43,49,43,53],[36,8,36,19],[47,22,47,24],[44,40,44,45],[42,22,42,24],[44,22,44,25],[39,22,39,25],[49,8,49,19],[39,34,39,37],[47,40,47,45],[47,48,47,53],[44,48,44,53],[7,8,8,19],[23,8,24,19],[39,8,40,19],[28,48,28,53],[42,49,42,53],[42,41,42,45],[10,41,10,45],[10,49,10,53],[11,41,11,45],[11,49,11,53],[27,41,27,45],[27,49,27,53],[15,40,15,45],[15,48,15,53],[53,2,53,45],[44,33,44,37],[31,40,31,45],[7,34,7,37],[15,22,15,24],[7,22,7,25],[10,22,10,24],[10,32,10,37],[12,22,12,25],[12,33,12,37],[23,22,23,25],[23,34,23,37],[28,22,28,25],[26,41,26,45],[28,33,28,37],[31,22,31,24]]}
[]
[null,null,"IV.1. HARTA TIDAK BERGERAK (TANAH DAN/ATAU BANGUNAN)"]
[]
[null,null,"NO","LOKASI",null,null,null,null,null,null,null,null,null,null,null,null,null,null,null,null,null,"LUAS",null,null,null,null,null,"KEPEMILIKAN",null,null,null,null,null,null,null,null,null,null,null,"NILAI PEROLEHAN",null,null,null,null,null,null,null,"NILAI ESTIMASI\nSAAT PELAPORAN"]
[]
[null,null,"(1)","(2)",null,null,null,null,null,null,null,null,null,null,null,null,null,null,null,null,null,"(3)",null,null,null,null,null,"(4)",null,null,null,null,null,null,null,null,null,null,null,"(5)",null,null,null,null,null,null,null,"(6)"]
{"$rows_left_out":65}
{"sheet":"IV.2.1","index":6,"n_rows":55,"n_cols":61,"rows_kept":55,"cut":false,"hidden":false,"merged":[[11,7,11,21],[15,11,15,20],[20,7,20,21],[22,7,22,21],[26,11,26,20],[13,11,13,14],[24,11,24,14],[11,30,11,35],[23,40,23,43],[12,40,12,43],[22,30,22,35],[13,37,13,42],[11,37,11,42],[20,38,20,42],[22,37,22,42],[15,29,15,35],[9,46,9,50],[10,38,10,42],[1,1,1,52],[3,44,4,51],[3,36,4,43],[5,44,5,51],[5,36,5,43],[3,2,4,2],[3,23,4,35],[5,23,5,35],[5,3,5,22],[3,3,4,22],[10,46,10,50],[9,7,9,21],[9,38,9,42],[7,2,15,2],[11,45,11,50],[13,45,13,50],[12,48,12,51],[22,45,22,50],[24,37,24,42],[24,45,24,50],[20,46,20,50],[21,38,21,42],[21,46,21,50],[39,46,40,50],[31,38,31,42],[31,46,31,50],[23,48,23,51],[32,38,32,42],[32,46,32,50],[33,45,33,50],[35,37,35,42],[35,45,35,50],[34,40,34,43],[34,48,34,51],[40,2,40,43],[33,7,33,21],[37,11,37,20],[33,37,33,42],[33,30,33,35],[37,29,37,35],[39,2,39,42],[26,29,26,35],[18,2,26,2],[29,2,37,2],[31,7,31,21],[35,11,35,14]]}
[]
[null,"IV.2.1. HARTA BERGERAK (ALAT TRANSPORTASI DAN MESIN)",null,null,null,null,null,null,null,null,null,null,null,null,null,null,null,null,null,null,null,null,null,null,null,null,null,null,null,null,null,null,null,null,null,null,null,null,null,null,null,null,null,null,null,null,null,null,null,null,null,null,null,"."]
[]
[null,null,"NO","URAIAN",null,null,null,null,null,null,null,null,null,null,null,null,null,null,null,null,null,null,null,"KEPEMILIKAN",null,null,null,null,null,null,null,null,null,null,null,null,"NILAI PEROLEHAN",null,null,null,null,null,null,null,"NILAI ESTIMASI \nSAAT PELAPORAN",null,null,null,null,null,null,null,null,null,"Pemanfaatan"]
[]
[null,null,"(1)","(2)",null,null,null,null,null,null,null,null,null,null,null,null,null,null,null,null,null,null,null,"(3)",null,null,null,null,null,null,null,null,null,null,null,null,"(4)",null,null,null,null,null,null,null,"(5)"]
{"$rows_left_out":50}
{"sheet":"IV.2.2","index":7,"n_rows":59,"n_cols":59,"rows_kept":59,"cut":false,"hidden":false,"merged":[[7,2,13,2],[16,2,22,2],[25,2,31,2],[34,2,41,2],[46,2,46,5],[39,34,39,40],[39,7,39,22],[41,9,41,22],[43,2,43,40],[43,44,44,49],[7,13,7,22],[3,42,4,50],[5,3,5,24],[5,25,5,32],[5,33,5,41],[5,42,5,50],[7,26,7,29],[1,1,1,51],[3,2,4,2],[3,3,4,24],[3,25,4,32],[3,33,4,41],[11,7,11,22],[13,9,13,22],[9,35,9,40],[9,44,9,49],[18,35,18,40],[18,44,18,49],[16,13,16,22],[9,7,9,10],[18,7,18,10],[16,26,16,29],[20,7,20,22],[22,9,22,22],[29,7,29,22],[31,9,31,22],[27,7,27,10],[37,7,37,10],[38,35,38,40],[27,35,27,40],[25,13,25,22],[34,13,34,22],[27,44,27,49],[37,35,37,40],[37,44,37,49],[25,26,25,29],[34,26,34,29]]}
[]
[null,"IV.2.2. HARTA BERGERAK LAINNYA"]
[]
[null,null,"NO","URAIAN",null,null,null,null,null,null,null,null,null,null,null,null,null,null,null,null,null,null,null,null,null,"ASAL-USUL HARTA 2)",null,null,null,null,null,null,null,"NILAI PEROLEHAN",null,null,null,null,null,null,null,null,"NILAI ESTIMASI \nSAAT PELAPORAN"]
[]
[null,null,"(1)","(2)",null,null,null,null,null,null,null,null,null,null,null,null,null,null,null,null,null,null,null,null,null,"(3)",null,null,null,null,null,null,null,"(4)",null,null,null,null,null,null,null,null,"(5)"]
{"$rows_left_out":54}
{"sheet":"IV.3","index":8,"n_rows":57,"n_cols":63,"rows_kept":57,"cut":false,"hidden":false,"merged":[[42,47,43,53],[7,2,13,2],[16,2,22,2],[25,2,31,2],[34,2,40,2],[9,20,12,24],[18,20,21,24],[9,47,9,53],[18,47,18,53],[27,47,27,53],[36,47,36,53],[22,11,22,17],[27,11,27,17],[29,11,29,17],[27,20,30,24],[18,11,18,17],[1,1,1,55],[3,2,4,2],[5,26,5,33],[3,3,4,18],[5,45,5,54],[5,3,5,18],[3,45,4,54],[3,19,4,25],[20,11,20,17],[3,26,4,33],[5,34,5,44],[5,19,5,25],[3,34,4,44],[7,26,7,29],[16,26,16,29],[25,26,25,29],[34,26,34,29],[43,2,43,43],[9,36,9,43],[18,36,18,43],[27,36,27,43],[42,2,42,43],[31,11,31,17],[36,11,36,17],[38,11,38,17],[40,11,40,17],[36,20,39,24],[36,36,36,43],[9,11,9,17],[11,11,11,17],[13,11,13,17]]}
[]
[null,"IV.3. SURAT BERHARGA"]
[]
[null,null,"NO","URAIAN",null,null,null,null,null,null,null,null,null,null,null,null,null,null,null,"NO REKENING/ \nID NASABAH",null,null,null,null,null,null,"ASAL USUL HARTA 3)",null,null,null,null,null,null,null,"NILAI PEROLEHAN",null,null,null,null,null,null,null,null,null,null,"NILAI ESTIMASI \nSAAT PELAPORAN"]
[]
[null,null,"(1)","(2)",null,null,null,null,null,null,null,null,null,null,null,null,null,null,null,"(3)",null,null,null,null,null,null,"(4)",null,null,null,null,null,null,null,"(5)",null,null,null,null,null,null,null,null,null,null,"(6)"]
{"$rows_left_out":52}
{"sheet":"IV.4","index":9,"n_rows":61,"n_cols":44,"rows_kept":61,"cut":false,"hidden":false,"merged":[[44,18,44,19],[7,2,14,2],[17,2,24,2],[10,4,14,10],[27,2,34,2],[30,4,34,10],[20,4,24,10],[1,1,1,36],[3,2,4,2],[3,3,4,11],[3,21,4,28],[5,3,5,11],[3,12,4,20],[3,29,4,35],[5,21,5,28],[5,12,5,20],[5,29,5,35],[51,30,52,30],[39,30,39,33],[22,32,22,34],[42,32,42,34],[9,30,9,33],[10,32,10,34],[29,30,29,33],[30,32,30,34],[27,32,27,34],[37,32,37,34],[12,32,12,34],[14,32,14,34],[24,32,24,34],[46,31,47,34],[19,30,19,33],[17,32,17,34],[7,32,7,34],[42,14,42,19],[47,2,47,27],[46,2,46,27],[20,32,20,34],[32,32,32,34],[40,32,40,34],[34,32,34,34],[44,32,44,34],[37,2,44,2],[40,4,44,10],[27,13,27,19],[32,14,32,19],[38,14,39,19],[7,21,7,24],[17,21,17,24],[27,21,27,24],[37,21,37,24],[37,13,37,19],[7,13,7,19],[12,14,12,19],[17,13,17,19],[22,14,22,19],[8,14,9,19],[18,14,19,19],[28,14,29,19],[14,18,14,19],[24,18,24,19],[34,18,34,19]]}
[]
[null,"IV.4. KAS DAN SETARA KAS "]
[]
[null,null,"NO","URAIAN",null,null,null,null,null,null,null,null,"INFO REKENING",null,null,null,null,null,null,null,null,"ASAL USUL HARTA 3)",null,null,null,null,null,null,null,"NILAI SALDO"]
[]
[null,null,"(1)","(2)",null,null,null,null,null,null,null,null,"(3)",null,null,null,null,null,null,null,null,"(4)",null,null,null,null,null,null,null,"(5)"]
{"$rows_left_out":56}
{"sheet":"IV.5","index":10,"n_rows":48,"n_cols":54,"rows_kept":48,"cut":false,"hidden":false,"merged":[[6,2,10,2],[12,2,16,2],[18,2,22,2],[24,2,28,2],[14,33,14,36],[13,33,13,36],[19,9,19,21],[21,8,21,21],[19,33,19,36],[7,33,7,37],[6,23,6,26],[12,23,12,26],[18,23,18,26],[13,40,13,43],[14,40,14,43],[16,8,16,21],[15,8,15,21],[5,38,5,44],[5,3,5,22],[5,23,5,30],[5,31,5,37],[7,9,7,21],[9,8,9,21],[10,8,10,21],[7,40,7,43],[8,40,8,43],[13,9,13,21],[8,33,8,36],[3,38,4,44],[1,1,1,45],[3,2,4,2],[3,3,4,22],[3,23,4,30],[3,31,4,37],[19,40,19,43],[20,33,20,36],[20,40,20,43],[30,2,30,36],[30,40,30,43],[22,8,22,21],[25,9,25,21],[27,8,27,21],[28,8,28,21],[24,23,24,26],[31,2,31,36],[25,33,25,36],[26,33,26,36],[25,40,25,43],[26,40,26,43]]}
[]
[null,"IV.5. HARTA LAINNYA"]
[]
[null,null,"NO","URAIAN",null,null,null,null,null,null,null,null,null,null,null,null,null,null,null,null,null,null,null,"ASAL USUL HARTA 2)",null,null,null,null,null,null,null,"NILAI PEROLEHAN",null,null,null,null,null,null,"NILAI ESTIMASI SAAT PELAPORAN"]
[]
[null,null,"(1)","(2)",null,null,null,null,null,null,null,null,null,null,null,null,null,null,null,null,null,null,null,"(3)",null,null,null,null,null,null,null,"(4)",null,null,null,null,null,null,"(5)"]
{"$rows_left_out":43}
{"sheet":"IV.6","index":11,"n_rows":46,"n_cols":46,"rows_kept":46,"cut":false,"hidden":false,"merged":[[18,5,18,9],[14,12,18,20],[14,35,14,36],[13,2,19,2],[20,2,26,2],[21,12,25,20],[26,5,26,9],[18,3,18,4],[25,3,25,4],[3,11,4,21],[3,33,4,37],[3,2,4,2],[7,35,7,36],[7,23,11,31],[6,2,12,2],[8,35,8,36],[12,5,12,9],[11,5,11,9],[11,3,11,4],[1,1,1,45],[5,38,5,44],[5,3,5,10],[9,35,9,36],[10,35,10,36],[3,3,4,10],[3,38,4,44],[5,33,5,37],[5,11,5,21],[5,22,5,32],[7,40,7,42],[9,40,9,42],[8,40,8,42],[10,40,10,42],[7,12,11,20],[3,22,4,32],[14,40,14,42],[25,5,25,9],[22,35,22,36],[22,40,22,42],[23,35,23,36],[24,35,24,36],[21,35,21,36],[16,40,16,42],[17,40,17,42],[16,35,16,36],[17,35,17,36],[15,35,15,36],[15,40,15,42],[14,23,18,31],[21,23,25,31],[19,5,19,9],[32,5,32,9],[33,5,33,9],[31,40,31,42],[35,40,35,42],[34,40,34,42],[28,23,32,31],[34,2,34,36],[28,35,28,36],[29,35,29,36],[30,35,30,36],[28,40,28,42],[30,40,30,42],[27,2,33,2],[28,12,32,20],[32,3,32,4],[21,40,21,42],[23,40,23,42],[24,40,24,42],[29,40,29,42],[31,35,31,36]]}
[]
[null,"IV.6.  HUTANG"]
[]
[null,null,"No","URAIAN",null,null,null,null,null,null,null,"NAMA KREDITUR",null,null,null,null,null,null,null,null,null,null,"BENTUK AGUNAN",null,null,null,null,null,null,null,null,null,null,"NILAI AWAL HUTANG",null,null,null,null,"NILAI SALDO HUTANG"]
[]
[null,null,"(1)","(2)",null,null,null,null,null,null,null,"(3)",null,null,null,null,null,null,null,null,null,null,"(4)",null,null,null,null,null,null,null,null,null,null,"(5)",null,null,null,null,"(6)"]
{"$rows_left_out":41}
{"sheet":"V.Penerimaan","index":12,"n_rows":67,"n_cols":50,"rows_kept":67,"cut":false,"hidden":false,"merged":[[25,35,25,48],[40,35,42,48],[43,35,45,48],[44,2,44,32],[60,2,60,32],[63,2,63,32],[28,35,30,48],[59,35,61,48],[62,35,64,48],[25,21,25,33],[51,20,51,32],[54,20,54,32],[57,20,57,32],[53,35,55,48],[56,35,58,48],[32,3,32,5],[29,6,29,18],[32,6,32,18],[29,20,29,32],[32,20,32,32],[55,3,55,5],[56,3,56,5],[57,3,57,5],[58,3,58,5],[1,1,1,49],[4,2,5,2],[4,34,5,48],[6,34,6,48],[4,3,5,33],[6,3,6,33],[7,2,7,48],[10,3,10,5],[8,2,9,5],[8,6,9,19],[8,20,9,33],[2,1,2,18],[2,20,2,22],[10,7,11,19],[11,3,11,5],[51,3,51,5],[53,3,53,5],[54,3,54,5],[51,6,51,18],[54,6,54,18],[39,3,39,5],[41,3,41,5],[42,3,42,5],[41,6,41,18],[41,20,41,32],[38,3,38,5],[38,6,38,18],[10,35,11,48],[12,35,14,48],[47,35,49,48],[48,20,48,32],[15,35,17,48],[18,35,20,48],[21,35,23,48],[31,35,33,48],[34,35,36,48],[37,35,39,48],[27,2,27,48],[21,3,21,5],[22,3,22,5],[23,3,23,5],[17,3,17,5],[18,3,18,5],[19,3,19,5],[16,3,16,5],[15,3,15,5],[20,3,20,5],[25,2,25,5],[12,3,12,5],[13,3,13,5],[14,3,14,5],[50,35,52,48],[64,2,64,5],[33,3,33,5],[34,3,34,5],[35,3,35,5],[36,3,36,5],[37,3,37,5],[29,3,29,5],[30,3,30,5],[46,2,46,48],[38,20,38,32],[35,6,35,18],[35,20,35,32],[57,6,57,18],[52,3,52,5],[47,3,47,5],[48,3,48,5],[49,3,49,5],[50,3,50,5],[48,6,48,18],[25,7,25,19],[12,7,14,19],[15,7,17,19],[18,7,20,19],[21,7,23,19],[10,21,11,33],[12,21,14,33],[15,21,17,33],[18,21,20,33],[21,21,23,33]]}
[]
[null,"V. INFORMASI PENERIMAAN TUNAI"]
[null,"Januari s.d. Desember Tahun"]
[]
[null,null,"NO","JENIS PENERIMAAN",null,null,null,null,null,null,null,null,null,null,null,null,null,null,null,null,null,null,null,null,null,null,null,null,null,null,null,null,null,null,"TOTAL PENERIMAAN"]
[]
{"$rows_left_out":62}
{"sheet":"VI.Pengeluaran","index":13,"n_rows":55,"n_cols":23,"rows_kept":55,"cut":false,"hidden":false,"merged":[[8,2,8,21],[12,3,12,9],[13,3,13,9],[9,3,10,9],[14,3,14,9],[11,3,11,9],[9,11,11,21],[12,11,14,21],[1,1,1,22],[4,2,5,2],[4,3,5,9],[4,10,5,21],[6,3,6,9],[6,10,6,21],[2,1,2,7],[45,3,45,9],[46,3,46,9],[48,2,48,9],[31,11,33,21],[34,11,36,21],[31,3,31,9],[32,3,32,9],[33,3,33,9],[35,2,35,9],[42,3,42,9],[43,3,43,9],[25,11,27,21],[15,11,17,21],[18,11,20,21],[28,11,30,21],[21,11,23,21],[24,2,24,21],[18,3,18,9],[19,3,19,9],[20,3,20,9],[28,3,28,9],[29,3,29,9],[30,3,30,9],[17,3,17,9],[26,3,26,9],[27,3,27,9],[22,2,22,9],[25,3,25,9],[15,3,15,9],[16,3,16,9],[51,2,51,9],[37,2,37,21],[41,3,41,9],[44,11,46,21],[47,11,49,21],[50,11,52,21],[52,2,52,9],[44,3,44,9],[38,11,40,21],[41,11,43,21],[38,3,38,9],[39,3,39,9],[40,3,40,9]]}
[]
[null,"VI. INFORMASI PENGELUARAN TUNAI"]
[null,"Januari s.d. Desember Tahun",null,null,null,null,null,null,{"$f":"IF(V.Penerimaan!U3=\"\",\"\",V.Penerimaan!U3)","v":""}]
[]
[null,null,"NO","JENIS PENGELUARAN",null,null,null,null,null,null,"TOTAL PENGELUARAN"]
[]
{"$rows_left_out":50}
{"sheet":"Lampiran1-Penjualan-Pelepasan","index":14,"n_rows":51,"n_cols":44,"rows_kept":51,"cut":false,"hidden":false,"merged":[[23,36,25,41],[30,36,32,41],[37,36,39,41],[14,2,18,2],[21,2,25,2],[28,2,32,2],[35,2,39,2],[14,36,14,41],[35,36,35,41],[28,36,28,41],[21,36,21,41],[16,36,18,41],[14,11,15,11],[21,11,22,11],[16,7,18,12],[23,7,25,12],[7,2,11,2],[9,36,11,41],[1,2,1,43],[3,3,4,13],[3,14,4,24],[3,25,4,32],[3,33,4,42],[7,11,8,11],[3,2,4,2],[5,33,5,42],[5,25,5,32],[5,3,5,13],[5,14,5,24],[7,36,7,41],[7,15,11,23],[37,7,39,12],[9,26,9,31],[16,26,16,31],[23,26,23,31],[30,26,30,31],[37,26,37,31],[35,11,36,11],[28,11,29,11],[30,7,32,12],[9,7,11,12],[14,15,18,23],[21,15,25,23],[28,15,32,23],[35,15,39,23]]}
[]
[null,null,"LAMPIRAN 1 - INFORMASI PENJUALAN/PELEPASAN HARTA DAN PENERIMAAN/PEMBERIAN HIBAH DALAM SETAHUN"]
[]
[null,null,"NO","URAIAN ",null,null,null,null,null,null,null,null,null,null,"NAMA HARTA",null,null,null,null,null,null,null,null,null,null,"NILAI",null,null,null,null,null,null,null,"INFORMASI PIHAK KEDUA"]
[]
[null,null,"(1)","(2)",null,null,null,null,null,null,null,null,null,null,"(3)",null,null,null,null,null,null,null,null,null,null,"(4)",null,null,null,null,null,null,null,"(5)"]
{"$rows_left_out":46}
{"sheet":"Lampiran2-Fasilitas","index":15,"n_rows":53,"n_cols":42,"rows_kept":53,"cut":false,"hidden":false,"merged":[[7,31,11,39],[14,31,18,39],[21,31,25,39],[28,31,32,39],[35,31,39,39],[7,18,11,28],[14,18,18,28],[21,18,25,28],[28,18,32,28],[35,18,39,28],[7,2,11,2],[14,2,18,2],[21,2,25,2],[28,2,32,2],[35,2,39,2],[5,3,5,16],[1,2,1,40],[3,2,4,2],[3,3,4,16],[3,17,4,29],[3,30,4,40],[5,17,5,29],[5,30,5,40],[9,7,11,15],[16,7,18,15],[23,7,25,15],[30,7,32,15],[37,7,39,15]]}
[]
[null,null,"LAMPIRAN 2 - INFORMASI PENERIMAAN FASILITAS/BENEFIT DALAM SETAHUN"]
[]
[null,null,"NO","URAIAN",null,null,null,null,null,null,null,null,null,null,null,null,null,"NAMA PIHAK PEMBERI FASILITAS",null,null,null,null,null,null,null,null,null,null,null,null,"KETERANGAN"]
[]
[null,null,"(1)","(2)",null,null,null,null,null,null,null,null,null,null,null,null,null,"(3)",null,null,null,null,null,null,null,null,null,null,null,null,"(4)"]
{"$rows_left_out":48}
{"sheet":"Lampiran3-SKM","index":16,"n_rows":42,"n_cols":58,"rows_kept":42,"cut":false,"hidden":false,"merged":[[30,50,30,54],[27,3,27,56],[21,3,21,56],[22,3,22,56],[23,3,23,56],[25,3,25,56],[26,3,26,56],[18,3,18,56],[19,3,19,56],[39,44,39,54],[2,3,2,56],[4,3,4,56],[6,12,6,43],[7,12,7,23],[8,12,8,43],[9,12,9,43],[7,25,7,43],[11,3,11,56],[13,3,13,56],[15,3,15,56],[16,3,16,56],[31,43,31,55],[30,44,30,48]]}
[]
[]
[null,null,null,"LAMPIRAN 3 - SURAT KUASA MENGUMUMKAN"]
[]
[null,null,null,"Yang bertanda-tangan di bawah ini :-----------------------------------------------------------------------------------------------------------------------------------------------------------------------------------------------------------"]
[]
{"$rows_left_out":37}
{"sheet":"Lampiran4-SKB","index":17,"n_rows":50,"n_cols":60,"rows_kept":50,"cut":false,"hidden":false,"merged":[[47,44,47,54],[7,27,7,44],[34,3,34,57],[35,3,35,57],[36,3,36,57],[39,43,39,55],[38,44,38,48],[38,50,38,54],[26,6,26,57],[27,6,27,57],[28,6,28,57],[30,3,30,57],[31,3,31,57],[32,3,32,57],[20,5,20,57],[21,5,21,57],[22,6,22,57],[23,6,23,57],[24,6,24,57],[25,5,25,57],[11,3,11,57],[13,3,13,57],[15,3,15,57],[16,3,16,57],[17,3,17,57],[19,3,19,57],[9,14,9,45],[2,3,2,57],[4,3,4,57],[6,14,6,45],[7,14,7,25],[8,14,8,45]]}
[]
[]
[null,null,null,"LAMPIRAN 4 - SURAT KUASA"]
[]
[null,null,null,"Yang bertanda-tangan di bawah ini :-------------------------------------------------------------------------------------------------------------------------------------------------------------------------------------------------------------------"]
[]
{"$rows_left_out":45}
{"sheet":"Lembar Penyerahan","index":18,"n_rows":47,"n_cols":47,"rows_kept":47,"cut":false,"hidden":false,"merged":[[3,9,3,18],[3,33,3,43],[4,9,4,18],[4,33,4,43],[5,9,5,18],[5,33,5,43],[6,9,6,18],[6,33,6,43],[9,2,9,21],[9,26,9,46],[10,2,10,21],[10,26,10,46],[12,2,12,21],[12,26,12,46],[18,9,18,20],[18,34,18,45],[25,9,25,10],[25,12,25,13],[25,15,25,18],[25,34,25,35],[25,37,25,38],[25,40,25,43],[29,38,29,45],[29,3,29,11],[29,27,29,36],[31,4,31,11],[31,14,31,20],[31,28,31,35],[31,39,31,45],[26,38,26,40],[26,13,26,15],[26,17,26,20],[14,9,14,20],[16,9,16,20],[20,9,20,20],[14,34,14,45],[16,34,16,45],[20,34,20,45],[26,41,26,44],[32,6,32,11],[32,16,32,20],[34,6,34,11],[34,16,36,20],[38,2,39,11],[38,16,39,20],[26,3,26,5],[26,7,26,11],[26,27,26,29],[26,31,26,36],[29,13,29,20],[38,41,38,45],[32,30,32,35],[34,30,34,35],[32,41,32,45],[34,41,36,45],[38,26,39,35]]}
[]
[null,null,null,null,null,null,null,null,null,null,null,null,null,null,null,null,null,null,null,null,"Lembar untuk KPK",null,null,null,null,null,null,null,null,null,null,null,null,null,null,null,null,null,null,null,null,null,null,null,null,"Lembar untuk Penyelenggara Negara"]
[]
[null,null,null,null,null,null,null,null,null,"KOMISI PEMBERANTASAN KORUPSI",null,null,null,null,null,null,null,null,null,null,null,null,null,null,null,null,null,null,null,null,null,null,null,"KOMISI PEMBERANTASAN KORUPSI"]
[null,null,null,null,null,null,null,null,null,"REPUBLIK INDONESIA",null,null,null,null,null,null,null,null,null,null,null,null,null,null,null,null,null,null,null,null,null,null,null,"REPUBLIK INDONESIA"]
[null,null,null,null,null,null,null,null,null,"Jl. Kuningan Persada Kav. 4, Setiabudi",null,null,null,null,null,null,null,null,null,null,null,null,null,null,null,null,null,null,null,null,null,null,null,{"$f":"J6","v":"Jl. Kuningan Persada Kav. 4, Setiabudi"}]
{"$rows_left_out":42}
{"sheet":"DATA","index":19,"n_rows":195,"n_cols":19,"rows_kept":195,"cut":false,"hidden":true,"merged":[]}
["Keluarga","Jenis Kelamin",null,"Mata Uang",null,null,null,null,"Tahun Pelaporan",null,"Bulan",null,"Hari",null,"Periodik2",null,"Khusus1"]
[]
["Suami","Pria",null,"Indonesia","Rupiah","IDR",{"$f":"CONCATENATE(D3,\"  (\",F3,\")\")","v":"Indonesia  (IDR)"},null,null,null,null,null,null,null,null,null,null,null,"Indonesia  (IDR)"]
["Istri","Wanita",null,"Amerika Serikat","Dollar","USD","Amerika Serikat  (USD)",null,2026,null,1,null,1,null,2026,null,"Hari",null,"Amerika Serikat  (USD)"]
["Anak Tanggungan",null,null,"Singapura","Dollar","SGD","Singapura  (SGD)",null,2025,null,2,null,2,null,2025,null,"Bulan",null,"Singapura  (SGD)"]
["Anak Bukan Tanggungan",null,null,"Uni Emirat Arab","Dirham","AED","Uni Emirat Arab  (AED)",null,2024,null,3,null,3,null,2024,null,"Periodik2",null,"Uni Emirat Arab  (AED)"]
{"$rows_left_out":189}